{"text_format":"1","workbook":"xlsx","n_sheets":7,"sheets":["Loan Analysis Worksheet","Formulas for Loan Amount","Rate Sheet","Drop Down List","Initial Estimate","LA 30 Year","Initial 30 Year Estimate"],"not_rendered":{"charts":0,"images":1,"macros":0,"external_links":0,"defined_names":1,"comments":1,"pivot_tables":0},"unopened":[],"bounds":{"document_bytes":16777216,"sheet_cells":100000,"rows_first":2000,"rows_last":500,"rows_between":2000,"halvings":0,"cell_chars":16384,"cell_head_chars":4096},"cells_cut":0,"cells_raw":0,"read":"whole","date_system":"1900"}

{"sheet":"Loan Analysis Worksheet","index":0,"n_rows":41,"n_cols":16,"rows_kept":41,"cut":false,"hidden":false,"merged":[[7,9,7,11],[6,9,6,11],[5,10,5,11],[4,3,4,4],[40,14,40,15],[35,8,35,9],[37,8,37,9],[9,14,9,15],[14,14,14,15],[35,14,35,15],[38,3,38,5],[20,9,20,11],[23,9,23,11],[23,7,23,8],[1,1,1,6],[20,2,20,3],[23,2,23,6],[5,3,5,6],[6,3,6,6],[3,3,3,4],[7,3,7,6]]}
[]
[null,"                      LOAN ANALYSIS WORKSHEET"]
[]
[null,null,"Primary Guarantor:","Summer Reed",null,"Primary's Credit Score:",720]
[null,null,"Second Guarantor:",null,null,"Second's Credit Score:",640]
[null,null,"Broker Name:",null,null,null,null,null,null,"Does the loan amount exceed the FHA Cap?","No"]
[null,null,"Property Address:",null,null,null,null,null,"FHA Cap"]
[null,null,"Property Address:",null,null,null,null,null,"Loan Amount Override"]
[]
[null,null,null,null,"Loan Type:","Purchase & Rehab",null,"Cross Collateral"]
[null,null,null,null,"Units:",1,"Units:",1]
[null,null,null,null,"Properties on Loan:",1,"Additional Properties:",1]
[null,null,null,null,"Purchase Price:",580000,"Amount Owed:"]
[null,null,null,null,"Amount Owed:",null,"As-Is Value:",null,null,null,null,null,"Loan Amount Calculations"]
[null,null,null,null,"Rehab Bid:",60000,{"$f":"IF('Rate Sheet'!F26=\"No\",0,('Loan Analysis Worksheet'!F15*0.1))","v":0},null,null,null,null,null,"Max Qualifying Loan",{"$f":"'Formulas for Loan Amount'!I12","v":455000}]
[null,null,null,null,"10% Rehab Contingency:",{"$f":"IF(AND('Loan Analysis Worksheet'!F19>679.99,'Loan Analysis Worksheet'!F20>2.99),0,'Loan Analysis Worksheet'!G15)","v":0},null,null,null,null,null,null,"Loan Override",{"$f":"IF(J8>0,J8,N15)","v":455000}]
[null,null,null,null,"As-Is Value:",0,null,null,null,null,null,null,"FHA Cap",{"$f":"IF(AND(N16>J7,K6=\"Yes\"),J7,N16)","v":455000}]
[null,null,null,null,"After Repair Value (ARV):",700000,null,null,null,null,null,null,"Minimum Loan",{"$f":"IF(N17<30000,0,N17)","v":455000}]
[null,null,null,null,"Qualifying Credit Score:",{"$f":"IF(G5>0,((G4+G5)/2),G4)","v":680},null,null,null,null,null,null,"Max Loan",{"$f":"IF(N18>N15,N15,N18)","v":455000}]
[null,null,null,null,"Experience in the last 24 Months",16]
{"$rows_left_out":22}
{"sheet":"Formulas for Loan Amount","index":1,"n_rows":96,"n_cols":16,"rows_kept":96,"cut":false,"hidden":true,"merged":[[21,0,21,2],[24,0,24,2],[52,0,52,2],[53,0,53,2],[54,0,54,2],[55,0,55,2],[58,0,58,2],[28,0,28,3],[31,0,31,2],[32,0,32,2],[38,0,38,2],[39,0,39,3],[40,0,40,3],[35,0,35,2],[37,0,37,2],[57,0,57,2],[22,0,22,2],[23,0,23,2],[25,0,25,2],[26,0,26,2],[27,0,27,2],[36,0,36,2],[47,0,47,2],[48,0,48,2],[94,0,94,2],[11,5,11,7],[12,5,12,7],[14,5,14,6],[74,0,74,2],[75,0,75,2],[77,0,77,2],[78,0,78,2],[81,0,81,3],[82,0,82,2],[83,0,83,2],[84,0,84,2],[85,0,85,2],[51,0,51,2],[59,0,59,3],[60,0,60,2],[66,0,66,2],[30,0,30,2],[11,0,11,2],[68,0,68,3],[86,0,86,2],[87,0,87,3],[88,0,88,2],[20,0,20,2],[69,0,69,2],[65,0,65,2],[67,0,67,2],[61,0,61,2],[62,0,62,2],[63,0,63,2],[64,0,64,2],[50,0,50,2],[93,0,93,2],[92,0,92,2],[89,0,89,2],[91,0,91,2],[70,0,70,2],[71,0,71,2],[72,0,72,2],[73,0,73,2],[76,0,76,2],[90,0,90,2],[41,0,41,2],[42,0,42,2],[43,0,43,2],[44,0,44,2],[29,0,29,2],[56,0,56,2],[33,0,33,2],[34,0,34,2],[46,0,46,2],[49,0,49,2],[2,0,2,3],[3,0,3,3],[4,0,4,2],[5,0,5,2],[6,0,6,2],[7,0,7,2],[8,0,8,2],[9,0,9,2],[10,0,10,2],[10,5,10,7],[12,0,12,2],[13,0,13,2],[19,0,19,3],[16,0,16,2],[17,0,17,2],[14,0,14,2],[15,0,15,2],[15,8,15,9],[16,8,16,9],[17,8,17,9],[18,8,18,9],[19,8,19,9],[13,8,13,9],[13,5,13,7],[14,8,14,9],[18,0,18,2],[12,8,12,9],[76,4,76,5],[73,4,73,5],[30,6,30,15],[32,6,32,15],[31,6,31,15],[29,6,29,15],[28,6,28,15],[27,6,27,15],[26,5,26,15],[3,14,3,16],[10,15,10,16],[9,15,9,16],[8,15,8,16],[7,15,7,16],[5,15,5,16],[4,15,4,16],[6,15,6,16],[11,8,11,9],[11,15,11,16],[3,5,3,9],[4,8,4,9],[5,8,5,9],[6,8,6,9],[7,8,7,9],[8,8,8,9],[9,8,9,9],[10,8,10,9],[4,5,4,7],[5,5,5,7],[6,5,6,7],[7,5,7,7],[8,5,8,7],[9,5,9,7]]}
[]
[]
["Purchase Loan Amount"]
["Non-Student",null,null,null,null,"Master Loan amounts",null,null,null,null,null,null,null,null,"Cross Colateral"]
["Purchase Covered",null,null,{"$f":"SUM('Loan Analysis Worksheet'!F13*0.9)","v":522000},null,"Purchase",null,null,{"$f":"IF('Loan Analysis Worksheet'!F10=\"Purchase\",D39,0)","v":0},null,null,null,null,null,"Amount Owed:",{"$f":"'Loan Analysis Worksheet'!H13","v":0}]
["Rehab Covered",null,null,{"$f":"SUM('Loan Analysis Worksheet'!F15:F16)","v":60000},null,"Purchase and Rehab",null,null,{"$f":"IF('Loan Analysis Worksheet'!F10=\"Purchase & Rehab\",D39,0)","v":455000},null,null,null,null,null,"Value",{"$f":"'Loan Analysis Worksheet'!H14","v":0}]
["Purchase",null,null,{"$f":"IF('Loan Analysis Worksheet'!F10=\"Purchase\",D5,0)","v":0},null,"Refi",null,null,{"$f":"IF('Loan Analysis Worksheet'!F10=\"Refi\",D79,0)","v":0},null,null,null,null,null,"50% LTV",{"$f":"SUM(P6*0.5)","v":0}]
["Purchase & Rehab",null,null,{"$f":"IF('Loan Analysis Worksheet'!F10=\"Purchase & Rehab\",(D5+D6),0)","v":582000},null,"Refi and Rehab",null,null,{"$f":"IF('Loan Analysis Worksheet'!F10=\"Refi and Rehab\",D79,0)","v":0},null,null,null,null,null,{"$f":"IF('Rate Sheet'!F26=\"Yes\",\"70% LTV\",\"65% LTV\")","v":"65% LTV"},{"$f":"IF('Rate Sheet'!F26=\"Yes\",(P6*0.7),(P6*0.65))","v":0}]
["max loan",null,null,{"$f":"MAX(D7:D8)","v":582000},null,"Cash-out",null,null,{"$f":"IF('Loan Analysis Worksheet'!F10=\"Cash-Out\",D95,0)","v":0},null,null,null,null,null,"If loan is over 50% cash-out $2k",{"$f":"IF(AND(P5>P7,(P8-P5)>2000),(P7+2000),P7)","v":0}]
["Max Value",null,null,{"$f":"IF('Loan Analysis Worksheet'!F18>0,'Loan Analysis Worksheet'!F18,'Loan Analysis Worksheet'!F17)","v":700000},null,null,null,null,null,null,null,null,null,null,"Amount Owed or 50% + $2k",{"$f":"IF(P5>P9,(P5+2000),P9)","v":0}]
["65% LTV Cap",null,null,{"$f":"IF(D9>(65%*D10),(D10*65%),D9)","v":455000},null,null,null,null,{"$f":"MAX(I5:J10)","v":455000},null,null,null,null,null,"% Cap ",{"$f":"IF(P10>P8,P8,P10)","v":0}]
["50% LTV Cap",null,null,{"$f":"IF(D9>(50%*D10),(D10*50%),D9)","v":350000},null,"Max Loan",null,null,{"$f":"SUM(I11+P11)","v":455000}]
["Exception County or not",null,null,{"$f":"IF('Rate Sheet'!F38=\"Yes\",'Formulas for Loan Amount'!D12,'Formulas for Loan Amount'!D11)","v":455000}]
["Minimum LA $30k",null,null,{"$f":"IF(D13<30000,0,D13)","v":455000}]
["50% LTV",null,null,{"$f":"IF(D14<(D10*0.5),D14,(D10*0.5))","v":350000}]
["50% LTV value 60k >",null,null,{"$f":"IF(D10<60001,D15,D14)","v":455000}]
["90% LTC",null,null,{"$f":"SUM(('Loan Analysis Worksheet'!F13+'Loan Analysis Worksheet'!F15+'Loan Analysis Worksheet'!F16)*0.9)","v":576000}]
["90% LTC Cap",null,null,{"$f":"IF((D16/('Loan Analysis Worksheet'!F13+'Loan Analysis Worksheet'!F15+'Loan Analysis Worksheet'!F16))>0.9,'Formulas for Loan Amount'!D17,'Formulas for Loan Amount'!D16)","v":455000}]
["Max Pur Non Student LA",null,null,{"$f":"IF('Rate Sheet'!F26=\"No\",D18,0)","v":455000}]
["Student",null,null,null,null," "]
{"$rows_left_out":77}
{"sheet":"Rate Sheet","index":2,"n_rows":53,"n_cols":14,"rows_kept":53,"cut":false,"hidden":false,"merged":[[52,0,53,2],[41,4,44,5],[41,6,43,6],[44,6,44,7],[38,7,38,9],[37,0,42,0],[37,1,42,1],[48,2,50,2],[46,4,46,6],[47,4,48,5],[47,6,48,6],[49,4,50,5],[49,6,50,6],[44,0,47,2],[48,0,50,1],[40,4,40,6],[37,4,38,4],[34,7,34,9],[37,7,37,9],[37,5,38,5],[35,7,35,9],[36,7,36,9],[20,12,20,13],[18,12,18,13],[20,10,20,11],[20,6,20,7],[20,8,20,9],[27,4,29,6],[30,4,32,5],[30,6,32,6],[8,9,8,11],[17,0,17,4],[18,6,18,7],[18,8,18,9],[18,10,18,11],[26,0,30,0],[26,1,30,1],[25,0,25,2],[31,0,36,0],[31,1,36,1],[34,4,35,4],[34,5,35,5]]}
[]
[null,"Interest Rate","Origination Point","% Purchase Price","LTV","ARV","Rehab","Refi","Cash Out ",null,"Consulting Fee","Closing Fees"]
["Base Rates",8.9899999999999994E-2,1,1,"65-70%",0.7,1,0.65,"50-70%",null,697]
["Credit Score:"]
["720+",0,0,0.9,0.65,0.65,1,0.65,0.5]
["680-719",0.01,0.5,0.9,0.65,0.65,1,0.65,0.5]
["620-679",0.02,1,0.9,0.65,0.65,1,0.65,0.5]
["0-619",0.03,1.5,0.9,0.65,0.65,1,0.65,0.5]
["Experience:",null,null,null,null,null,null,null,null,"COGO Loans Only "]
["0",0.03,1.5,0.9,0.65,0.65,1,0.65,0.5,null,997]
["1-2",0.02,1,0.9,0.65,0.65,1,0.65,0.5,null,897]
["3-4",0.01,0.5,0.9,0.65,0.65,1,0.65,0.5,null,797]
["5+",0,0,0.9,0.7,0.7,1,0.65,0.5,null,697]
["Premium Student:",-0.01,-1,1,0.7,0.7,1,0.65,0.5]
[]
["No Appraisal:",0.01,1,0.9,"50-70%","65%-70%",1,0.65,"NA"]
[]
["Must do 1 loan per year with COGO to keep discounted fee status"]
[null,"Interest Rate","Points","Interest Rate","Points",null,{"$f":"A5","v":"720+"},null,{"$f":"A6","v":"680-719"},null,{"$f":"A7","v":"620-679"},null,{"$f":"A8","v":"0-619"}]
["Added the 1 and 1",{"$f":"SUM(B21+1%)","v":0.10989999999999998},{"$f":"SUM(C21+1)","v":2.5},{"$f":"MAX(G20,I20,K20,M20)","v":0.01},{"$f":"MAX(H20,J20,L20,N20)","v":0.5},null,{"$f":"IF('Loan Analysis Worksheet'!F19>720,'Rate Sheet'!B5,0)","v":0},{"$f":"IF('Loan Analysis Worksheet'!F19>720,'Rate Sheet'!C5,0)","v":0},{"$f":"IF(AND('Loan Analysis Worksheet'!F19>679,'Loan Analysis Worksheet'!F19<720),'Rate Sheet'!B6,0)","v":0.01},{"$f":"IF(AND('Loan Analysis Worksheet'!F19>679,'Loan Analysis Worksheet'!F19<720),'Rate Sheet'!C6,0)","v":0.5},{"$f":"IF(AND('Loan Analysis Worksheet'!F19>619,'Loan Analysis Worksheet'!F19<680),'Rate Sheet'!B7,0)","v":0},{"$f":"IF(AND('Loan Analysis Worksheet'!F19>619,'Loan Analysis Worksheet'!F19<680),'Rate Sheet'!C7,0)","v":0},{"$f":"IF(AND('Loan Analysis Worksheet'!F19>-1,'Loan Analysis Worksheet'!F19<620),'Rate Sheet'!B8,0)","v":0},{"$f":"IF(AND('Loan Analysis Worksheet'!F19>-1,'Loan Analysis Worksheet'!F19<620),'Rate Sheet'!C8,0)","v":0}]
{"$rows_left_out":34}
{"sheet":"Drop Down List","index":3,"n_rows":6,"n_cols":20,"rows_kept":6,"cut":false,"hidden":true,"merged":[]}
[]
[null,"Credit %",null,"Credit Points",null,"Experience %",null,"Experience Points",null,"Premium %",null,"Premium Points",null,"Term In Months",null,"No Appraisal",null,"Exception County",null,"Contigency 10%"]
[null,0,null,0,null,0.03,null,1.5,null,0,null,0,null,6,null,"No",null,"No",null,"No"]
[null,0.01,null,0.5,null,0.02,null,1,null,-0.01,null,-1,null,12,null,"Yes",null,"Yes",null,"Yes"]
[null,0.02,null,1,null,0.01,null,0.5,null,null,null,null,null,18]
[null,0.03,null,1.5,null,0,null,0,null,null,null,null,null,24]

{"sheet":"Initial Estimate","index":4,"n_rows":52,"n_cols":7,"rows_kept":52,"cut":false,"hidden":false,"merged":[[39,4,39,5],[49,2,49,3],[50,2,50,3],[50,4,50,5],[37,3,38,6],[1,1,1,6],[14,7,14,8],[21,2,21,3],[23,2,23,6],[14,4,14,5]]}
[]
[null,"           INITIAL ESTIMATE"]
[]
[]
[null,null,{"$f":"'Loan Analysis Worksheet'!C4","v":"Primary Guarantor:"},{"$f":"'Loan Analysis Worksheet'!D4","v":"Summer Reed"},null,{"$f":"'Loan Analysis Worksheet'!F4","v":"Primary's Credit Score:"},{"$f":"'Loan Analysis Worksheet'!G4","v":720}]
[null,null,{"$f":"'Loan Analysis Worksheet'!C5","v":"Second Guarantor:"},{"$f":"IF('Loan Analysis Worksheet'!D5=\"\",\"\",'Loan Analysis Worksheet'!D5)","v":""},null,{"$f":"'Loan Analysis Worksheet'!F5","v":"Second's Credit Score:"},{"$f":"IF('Loan Analysis Worksheet'!G5=\"\",\"\",'Loan Analysis Worksheet'!G5)","v":640}]
[null,null,{"$f":"'Loan Analysis Worksheet'!C6","v":"Broker Name:"},{"$f":"IF('Loan Analysis Worksheet'!D6=\"\",\"\",'Loan Analysis Worksheet'!D6)","v":""}]
[null,null,{"$f":"'Loan Analysis Worksheet'!C7","v":"Property Address:"},{"$f":"IF('Loan Analysis Worksheet'!D7=\"\",\"\",'Loan Analysis Worksheet'!D7)","v":""}]
[]
[null,null,null,null,"Loan Type:",{"$f":"'Loan Analysis Worksheet'!F10","v":"Purchase & Rehab"}]
[null,null,null,null,"Units:",{"$f":"'Loan Analysis Worksheet'!F11","v":1}]
[null,null,null,null,"Purchase Price:",522000]
[null,null,null,null,"Amount Owed:",{"$f":"'Loan Analysis Worksheet'!F14","v":0}]
[null,null,null,null,"Rehab Bid:",{"$f":"SUM('Loan Analysis Worksheet'!F15:F16)","v":60000}]
[null,null,null,null,"This is a reimbursement draw process. "]
[null,null,null,null,"As Is Value:",{"$f":"'Loan Analysis Worksheet'!F17","v":0}]
[null,null,null,null,"After Repair Value (ARV):",{"$f":"'Loan Analysis Worksheet'!F18","v":700000}]
[null,null,null,null,"Credit Score:",{"$f":"'Loan Analysis Worksheet'!F19","v":680}]
[null,null,null,null,"Experience:",{"$f":"'Loan Analysis Worksheet'!F20","v":16}]
[null,null,null,null,{"$f":"'Loan Analysis Worksheet'!E21","v":"Seller Second/Earnest Deposit:"},{"$f":"'Loan Analysis Worksheet'!F21","v":448000}]
{"$rows_left_out":33}
{"sheet":"LA 30 Year","index":5,"n_rows":75,"n_cols":24,"rows_kept":75,"cut":false,"hidden":false,"merged":[[50,0,50,2],[43,1,44,2],[27,1,27,5],[20,10,21,10],[65,3,65,5],[64,3,64,5],[63,7,64,11],[51,3,51,5],[50,3,50,5],[52,3,52,5],[33,11,34,11],[66,0,66,2],[65,0,65,2],[72,0,72,2],[69,0,69,2],[70,0,71,2],[73,0,73,2],[69,3,69,5],[68,3,68,5],[67,3,67,5],[66,3,66,5],[0,1,1,6],[4,1,4,6],[25,6,25,8],[24,6,24,8],[2,1,2,2],[3,1,3,2],[2,3,2,5],[3,3,3,5],[5,1,5,6],[7,0,7,7],[8,0,8,7],[3,12,4,12],[21,11,21,12],[29,9,29,10],[64,30,64,31],[27,11,28,11],[27,12,28,12],[3,8,4,11],[20,6,21,9],[51,0,51,2],[52,0,52,2],[55,0,56,2],[57,0,57,2],[59,0,59,2],[50,7,50,9],[53,0,53,2],[54,0,54,2],[58,0,58,2],[60,0,60,2],[61,0,61,2],[62,0,62,2],[55,7,55,9],[55,10,55,11],[56,7,56,9],[56,10,56,11],[65,30,65,31],[66,30,66,31],[36,11,36,12],[38,11,40,12],[49,5,49,9],[50,10,50,11],[51,7,52,9],[51,10,52,11],[53,7,53,9],[53,10,53,11],[54,7,54,9],[54,10,54,11],[57,7,58,9],[57,10,58,11],[58,3,58,5],[57,3,57,5],[55,3,56,5],[54,3,54,5],[53,3,53,5],[63,3,63,5],[62,3,62,5],[60,3,60,5],[61,3,61,5],[59,3,59,5],[67,30,67,31],[86,16,86,20],[83,25,83,28],[87,16,87,17],[87,19,87,20],[87,21,87,22],[84,27,84,28],[85,27,85,28],[86,27,86,28],[90,21,90,22],[87,27,87,28],[91,16,91,17],[91,19,91,20],[91,21,91,22],[88,27,88,28],[88,16,88,17],[88,19,88,20],[88,21,88,22],[89,16,89,17],[89,19,89,20],[89,21,89,22],[33,12,34,12],[74,0,74,2],[74,3,74,5],[97,17,97,20],[98,17,98,20],[93,17,93,20],[94,17,94,20],[95,17,95,20],[96,17,96,20],[92,17,92,20],[90,16,90,17],[90,19,90,20],[73,3,73,5],[72,3,72,5],[70,3,71,5],[59,7,59,9],[59,10,59,11],[60,7,62,9],[60,10,61,11],[62,10,62,11],[64,0,64,2],[63,0,63,2],[68,0,68,2],[67,0,67,2]]}
[null,"                      LOAN ANALYSIS WORKSHEET LONG TERM RENTAL",null,null,null,null,null,null,null,null,null,null,null,null,"Constructive Rate Adjustments by LTV"]
[null,null,null,null,null,null,null,null,null,null,null,null,null,null,"LTV",{"$f":"IF(C31<50,\"<=50\",)","v":"<=50"},{"$f":"IF(AND(C31>50.01%,C31<55.001%),\"50.01-55\",\"\")","v":""},{"$f":"IF(AND(C31>55.01%,C31<60.001%),\"55.01-60\",\"\")","v":""},{"$f":"IF(AND(C31>60.01%,C31<65.001%),\"60.01-65\",\"\")","v":""},{"$f":"IF(AND(C31>65.01%,C31<70.001%),\"65.01-70\",\"\")","v":""},{"$f":"IF(AND(C31>70.01%,C31<75.001%),\"70.01-75\",\"\")","v":"70.01-75"},{"$f":"IF(AND(C31>75.01%,C31<80.001%),\"75.01-80\",\"\")","v":""},"Add-On"]
["Primary Guarantor:","Summer Reed",null,"Primary's Credit Score:",null,null,720,null,null,null,null,null,null,null,{"$f":"IF(C23>759.9,\"760+\",0)","v":0},{"$f":"IF(AND(C31<50.001%,C23>759.9),-0.25%,0)","v":0},{"$f":"IF(AND(Q2=\"50.01-55\",O3=\"760+\"),-0.25%,0)","v":0},{"$f":"IF(AND(R2=\"55.01-60\",O3=\"760+\"),-0.25%,0)","v":0},{"$f":"IF(AND(S2=\"60.01-65\",O3=\"760+\"),-0.125%,0)","v":0},{"$f":"IF(AND(T2=\"65.01-70\",O3=\"760+\"),0%,0)","v":0},{"$f":"IF(AND(U2=\"70.01-75\",O3=\"760+\"),0.125%,0)","v":0},{"$f":"IF(AND(V2=\"75.01-80\",O3=\"760+\"),0%,0)","v":0},{"$f":"SUM(P3:V3)","v":0}]
["Second Guarantor:","Summer Reed",null,"Second's Credit Score:",null,null,null,null,"Does the client have 18 months of Short Term Rental history(If property is being used for short term rental)",null,null,null,"No",null,{"$f":"IF(AND(C23>739.9,C23<759.1),\"740-759\",0)","v":0},{"$f":"IF(AND(C31<50.001%,O4=\"740-759\"),-0.125%,0)","v":0},{"$f":"IF(AND(Q2=\"50.01-55\",O4=\"740-759\"),-0.125%,0)","v":0},{"$f":"IF(AND(R2=\"55.01-60\",O4=\"740-759\"),-0.125%,0)","v":0},{"$f":"IF(AND(S2=\"60.01-65\",O4=\"740-759\"),0%,0)","v":0},{"$f":"IF(AND(T2=\"65.01-70\",O4=\"740-759\"),0%,0)","v":0},{"$f":"IF(AND(U2=\"70.01-75\",O4=\"740-759\"),0.25%,0)","v":0},{"$f":"IF(AND(V2=\"75.01-80\",O4=\"740-759\"),0%,0)","v":0},{"$f":"SUM(P4:V4)","v":0}]
["Broker Name:",null,null,null,null,null,null,null,null,null,null,null,null,null,{"$f":"IF(AND(C23>719.9,C23<739.1),\"720-739\",0)","v":"720-739"},{"$f":"IF(AND(C31<50.001%,O5=\"720-739\"),0%,0)","v":0},{"$f":"IF(AND(Q2=\"50.01-55\",O5=\"720-739\"),0%,0)","v":0},{"$f":"IF(AND(R2=\"55.01-60\",O5=\"720-739\"),0%,0)","v":0},{"$f":"IF(AND(S2=\"60.01-65\",O5=\"720-739\"),0%,0)","v":0},{"$f":"IF(AND(T2=\"65.01-70\",O5=\"720-739\"),0.125%,0)","v":0},{"$f":"IF(AND(U2=\"70.01-75\",O5=\"720-739\"),0.375%,0)","v":3.7499999999999999E-3},{"$f":"IF(AND(V2=\"75.01-80\",O5=\"720-739\"),0%,0)","v":0},3.7499999999999999E-3]
["Property Address:",null,null,null,null,null,null,null,null,null,null,null,null,null,{"$f":"IF(AND(C23>699.9,C23<719.1),\"700-719\",0)","v":0},{"$f":"IF(AND(C31<50.001%,O6=\"700-719\"),0.125%,0)","v":0},{"$f":"IF(AND(Q2=\"50.01-55\",O6=\"700-719\"),0.125%,0)","v":0},{"$f":"IF(AND(R2=\"55.01-60\",O6=\"700-719\"),0.25%,0)","v":0},{"$f":"IF(AND(S2=\"60.01-65\",O6=\"700-719\"),0.25%,0)","v":0},{"$f":"IF(AND(T2=\"65.01-70\",O6=\"700-719\"),0.25%,0)","v":0},{"$f":"IF(AND(U2=\"70.01-75\",O6=\"700-719\"),0.5%,0)","v":0},"N/A",0]
[null,null,null,null,null,null,null,null,null,null,null,null,null,null,{"$f":"IF(AND(C23>679.9,C23<699.1),\"680-699\",0)","v":0},{"$f":"IF(AND(C31<50.001%,O7=\"680-699\"),0.125%,0)","v":0},{"$f":"IF(AND(Q2=\"50.01-55\",O7=\"680-699\"),0.125%,0)","v":0},{"$f":"IF(AND(R2=\"55.01-60\",O7=\"680-699\"),0.25%,0)","v":0},{"$f":"IF(AND(S2=\"60.01-65\",O7=\"680-699\"),0.25%,0)","v":0},{"$f":"IF(AND(T2=\"65.01-70\",O7=\"680-699\"),0.5%,0)","v":0},{"$f":"IF(AND(U2=\"70.01-75\",O7=\"680-699\"),0.75%,0)","v":0},"N/A",0]
["If the property is in one of the following states it has to be a ARM (AL, GA, KS, ME, MO, MS, NE, SD, WI, WY) ",null,null,null,null,null,null,null,null,null,null,null,null,null,{"$f":"IF(AND(C23>659.9,C23<679.1),\"660-679\",0)","v":0},{"$f":"IF(AND(C31<50.001%,O8=\"660-679\"),1%,0)","v":0},{"$f":"IF(AND(Q2=\"50.01-55\",O8=\"660-679\"),1%,0)","v":0},{"$f":"IF(AND(R2=\"55.01-60\",O8=\"660-679\"),1%,0)","v":0},{"$f":"IF(AND(S2=\"60.01-65\",O8=\"660-679\"),1%,0)","v":0},{"$f":"IF(AND(T2=\"65.01-70\",O8=\"660-679\"),1%,0)","v":0},"N/A","N/A",0]
["For 30 year loans we can no longer lend in AK and HI",null,null,null,null,null,null,null,null,null,null,null,null,null,{"$f":"IF(AND(C23>639.9,C23<659.1),\"640-659\",0)","v":0},{"$f":"IF(AND(C31<50.001%,O9=\"640-659\"),0,0)","v":0},{"$f":"IF(AND(Q2=\"50.01-55\",O9=\"640-659\"),0%,0)","v":0},{"$f":"IF(AND(R2=\"55.01-60\",O9=\"640-659\"),0%,0)","v":0},{"$f":"IF(AND(S2=\"60.01-65\",O9=\"640-659\"),0%,0)","v":0},"N/A","N/A","N/A",0]
[null,null,null,null,null,null,null,null,null,null,null,null,null,null,"0-639","N/A","N/A","N/A","N/A","N/A","N/A","N/A",0]
[null,"Loan Type","Purchase"]
[null,"Units",1,null,null,null,null,null,null,null,null,null,null,null,"By Property type"]
[null,"Properties",1,null,null,null,null,null,null,"(If Refi) Is the property currently rented:","No",null,null,null,{"$f":"IF(C12>1,\"2-4 Units\",\"\")","v":""},{"$f":"IF(AND(P2=\"65.01-70\",O13=\"2-4 Units\"),0.125%,0)","v":0},{"$f":"IF(AND(Q2=\"65.01-70\",O13=\"2-4 Units\"),0.125%,0)","v":0},{"$f":"IF(AND(R2=\"65.01-70\",O13=\"2-4 Units\"),0.125%,0)","v":0},{"$f":"IF(AND(S2=\"65.01-70\",O13=\"2-4 Units\"),0.125%,0)","v":0},{"$f":"IF(AND(T2=\"65.01-70\",O13=\"2-4 Units\"),0.25%,0)","v":0},{"$f":"IF(AND(U2=\"70.01-75\",O13=\"2-4 Units\"),0.25%,0)","v":0},{"$f":"IF(AND(V2=\"75.01-80\",O13=\"2-4 Units\"),0%,0)","v":0},{"$f":"SUM(P13:V13)","v":0}]
[null,"Purchase Price",100000,null,null,null,null,null,null,"Will this or is this a Short Term Rental (like Airbnb):","No",null,null,null,"Warrantable Condo",{"$f":"IF(AND(P2=\"70.01-75\",K15=\"Yes\"),0.125%,0)","v":0},{"$f":"IF(AND(Q2=\"70.01-75\",K15=\"Yes\"),0.125%,0)","v":0},{"$f":"IF(AND(R2=\"70.01-75\",K15=\"Yes\"),0.125%,0)","v":0},{"$f":"IF(AND(S2=\"70.01-75\",K15=\"Yes\"),0.125%,0)","v":0},{"$f":"IF(AND(T2=\"70.01-75\",K15=\"Yes\"),0.125%,0)","v":0},{"$f":"IF(AND(U2=\"70.01-75\",K15=\"Yes\"),0.375%,0)","v":0},"N/A",{"$f":"SUM(P14:U14)","v":0}]
[null,"Amount Owed",null,null,null,null,null,null,null,"Warrantable Condo:","No",null,null,null,"Non-Warrantable Condo",null,null,null,null,null,null,null,{"$f":"IF(K16=\"Yes\",0.875%,0)","v":0}]
[null,"AS-IS Value",100000,null,null,{"$f":"IF(C11=\"Purchase\",G16,C16)","v":100000},{"$f":"IF(C14>C16,C16,C14)","v":100000},null,null,"Non-Warrantable Condo:","No"]
[null,"Qualifying Value",{"$f":"IF(F16<100000,0,F16)","v":100000},null,null,null,null,null,null,"Are one of the borrowers a Foreign National with no established US credit:","No",null,null,null,"DSCR"]
[null,"Yearly Property  Tax",3000,null,null,null,null,null,null,null,null,null,null,null,{"$f":"IF(AND(M32>0,M32<1.0999),\"DSCR > 1.00x < 1.09x\",\"\")","v":""},{"$f":"IF(AND(O18=\"DSCR > 1.00x < 1.10x\",C31<50%),0.75%,0)","v":0},{"$f":"IF(AND(O18=\"DSCR > 1.00x < 1.10x\",Q2=\"50.01-55\"),0.75%,0)","v":0},{"$f":"IF(AND(O18=\"DSCR > 1.00x < 1.10x\",R2=\"55.01-60\"),0.75%,0)","v":0},{"$f":"IF(AND(O18=\"DSCR > 1.00x < 1.10x\",S2=\"60.01-65\"),0.75%,0)","v":0},{"$f":"IF(AND(O18=\"DSCR > 1.00x < 1.10x\",T2=\"65.01-70\"),0.75%,0)","v":0},{"$f":"IF(AND(O18=\"DSCR > 1.00x < 1.10x\",U2=\"70.01-75\"),0.75%,0)","v":0},{"$f":"IF(AND(O18=\"DSCR > 1.00x < 1.10x\",V2=\"75.01-80\"),0.75%,0)","v":0},{"$f":"SUM(P18:V18)","v":0}]
[null,"Yearly Property Insurance",1200,null,null,null,null,null,null,null,null,null,null,null,{"$f":"IF(AND(M32>1.1,M32<1.2),\"DSCR > 1.10x < 1.2x\",\"\")","v":"DSCR > 1.10x < 1.2x"},{"$f":"IF(AND(O19=\"DSCR > 1.10x < 1.2x\",C31<50%),0.5%,0)","v":0},{"$f":"IF(AND(O19=\"DSCR > 1.10x < 1.2x\",Q2=\"50.01-55\"),0.5%,0)","v":0},{"$f":"IF(AND(O19=\"DSCR > 1.10x < 1.2x\",R2=\"55.01-60\"),0.5%,0)","v":0},{"$f":"IF(AND(O19=\"DSCR > 1.10x < 1.2x\",S2=\"60.01-65\"),0.5%,0)","v":0},{"$f":"IF(AND(O19=\"DSCR > 1.10x < 1.2x\",T2=\"65.01-70\"),0.5%,0)","v":0},{"$f":"IF(AND(O19=\"DSCR > 1.10x < 1.2x\",U2=\"70.01-75\"),0.5%,0)","v":5.0000000000000001E-3},{"$f":"IF(AND(O19=\"DSCR > 1.10x < 1.2x\",V2=\"75.01-80\"),0.5%,0)","v":0},{"$f":"SUM(P19:V19)","v":5.0000000000000001E-3}]
[null,"Yearly HOA Dues",null,null,null,null,null,null,null,null,null,null,null,null,"DSCR >1.20x",0]
{"$rows_left_out":56}
{"sheet":"Initial 30 Year Estimate","index":6,"n_rows":50,"n_cols":6,"rows_kept":50,"cut":false,"hidden":false,"merged":[[47,2,47,3],[48,2,48,3],[48,4,48,5],[44,2,45,6],[1,1,1,8],[24,2,24,6],[22,5,23,6],[42,2,42,6],[46,3,46,5]]}
[]
[null,"           INITIAL 30 YEAR ESTIMATE"]
[]
[]
[null,{"$f":"'LA 30 Year'!A3:A6","v":"Primary Guarantor:"},{"$f":"'LA 30 Year'!B3","v":"Summer Reed"},null,{"$f":"'LA 30 Year'!D3","v":"Primary's Credit Score:"},{"$f":"'LA 30 Year'!G3","v":720}]
[null,"Second Guarantor:",{"$f":"IF('LA 30 Year'!B4=\"\",\"\",'LA 30 Year'!B4)","v":"Summer Reed"},null,{"$f":"'LA 30 Year'!D4","v":"Second's Credit Score:"},{"$f":"'LA 30 Year'!G4","v":0}]
[null,"Broker Name:",{"$f":"IF('LA 30 Year'!B5=\"\",\"\",'LA 30 Year'!B5)","v":""}]
[null,"Property Address:",{"$f":"IF('LA 30 Year'!B6=\"\",\"\",'LA 30 Year'!B6)","v":""}]
[]
[null,null,null,null,"Loan Type:",{"$f":"'LA 30 Year'!C11","v":"Purchase"}]
[null,null,null,null,"Units:",{"$f":"'LA 30 Year'!C12","v":1}]
[null,null,null,null,"Properties:",{"$f":"'LA 30 Year'!C13","v":1}]
[null,null,null,null,"Purchase Price:",{"$f":"SUM('LA 30 Year'!C14)","v":100000}]
[null,null,null,null,"Amount Owed:",{"$f":"'LA 30 Year'!C15","v":0}]
[null,null,null,null,"Qualifying Value:",{"$f":"'LA 30 Year'!C17","v":100000}]
[null,null,null,null,"Estimated Yearly Taxes:",{"$f":"'LA 30 Year'!C18","v":3000}]
[null,null,null,null,"Estimated Yearly Insurance:",{"$f":"'LA 30 Year'!C19","v":1200}]
[null,null,null,null,"Estimated Yearly HOA Dues:",{"$f":"'LA 30 Year'!C20","v":0}]
[null,null,null,null,"Credit Score:",{"$f":"'LA 30 Year'!C23","v":720}]
[null,null,null,null,{"$f":"'LA 30 Year'!B21","v":"Monthly Rent Income"},{"$f":"'LA 30 Year'!C21","v":1050}]
{"$rows_left_out":30}